﻿"Item Id","Item URI","Dublin Core:Title","Dublin Core:Subject","Dublin Core:Description","Dublin Core:Creator","Dublin Core:Source","Dublin Core:Publisher","Dublin Core:Date","Dublin Core:Contributor","Dublin Core:Rights","Dublin Core:Relation","Dublin Core:Format","Dublin Core:Language","Dublin Core:Type","Dublin Core:Identifier","Dublin Core:Coverage","Item Type Metadata:Lesson Plan Text","Item Type Metadata:Bibliography","Item Type Metadata:Biographical Text","Item Type Metadata:Occupation","Item Type Metadata:Death Date","Item Type Metadata:Birthplace","Item Type Metadata:Birth Date","Item Type Metadata:Participants","Item Type Metadata:Event Type","Item Type Metadata:URL","Item Type Metadata:Bit Rate/Frequency","Item Type Metadata:Interviewer","Item Type Metadata:Interviewee","Item Type Metadata:Location","Item Type Metadata:Transcription","Item Type Metadata:Local URL","Item Type Metadata:Original Format","Item Type Metadata:Physical Dimensions","Item Type Metadata:Duration","Item Type Metadata:Compression","Item Type Metadata:Producer","Item Type Metadata:Director","Item Type Metadata:Text","Item Type Metadata:Time Summary","Item Type Metadata:Email Body","Item Type Metadata:Subject Line","Item Type Metadata:From","Item Type Metadata:To","Item Type Metadata:CC","Item Type Metadata:BCC","Item Type Metadata:Number of Attachments","Item Type Metadata:Standards","Item Type Metadata:Objectives","Item Type Metadata:Materials",tags,file,itemType,collection,public,featured
252,https://www.penninehorizons.org/items/show/252,"Pennine Community Power Exhibition - AGW00171","Buildings, Community Fair, Event, Events, Exhibition, Hebden Bridge, Places, Stalls, Town Hall","Community Stalls at Hebden Bridge Council Offices providing information on community power projects, Oct 2012","Alan Greenwood","Alan Greenwood","Pennine Horizons Digital Archive",2012-10-13T10:08:35,"Alan Greenwood","PHDA - Alan Greenwood Collection","Pennine Horizons Digital Archive","TIFF file 8-bit","English (U.K.)","Documentary photograph",AGW00171.TIF,"Hebden Bridge",,,,,,,,,,,,,,,,,,,,,,,,,,,,,,,,,,,"Buildings,Community Fair,Event,Events,Exhibition,Hebden Bridge,Rotary Club,Stalls,Town Hall",https://www.penninehorizons.org/files/original/f7059b2474c8bfa8991e7fbb7cc2c4ba.jpg,"Still Image","Alan Greenwood Collection",1,0
269,https://www.penninehorizons.org/items/show/269,"Community Fayre at Hebden Bridge town Hall, October 2012 - AGW00188","Buildings, Community Fair, Event, Events, Exhibition, Hebden Bridge, Places, Stalls, Town Hall",,"Alan Greenwood","Alan Greenwood","Pennine Horizons Digital Archive","2012-10-13T10:12:27, 2010s","Alan Greenwood","PHDA - Alan Greenwood Collection","Pennine Horizons Digital Archive","TIFF file 8-bit","English (U.K.)","Documentary photograph",AGW00188.TIF,"Hebden Bridge",,,,,,,,,,,,,,,,,,,,,,,,,,,,,,,,,,,"Buildings,Community Fair,Event,Events,Exhibition,Hebden Bridge,Stalls,Town Hall",https://www.penninehorizons.org/files/original/4bfc88c36e0a47596b0d880511ae84a5.jpg,"Still Image","Alan Greenwood Collection",1,0
270,https://www.penninehorizons.org/items/show/270,"Community Fayre at Hebden Bridge town Hall, October 2012 - AGW00189","Buildings, Community Fair, Event, Events, Exhibition, Hebden Bridge, Places, Stalls, Town Hall",,"Alan Greenwood","Alan Greenwood","Pennine Horizons Digital Archive",2012-10-13T10:11:55,"Alan Greenwood","PHDA - Alan Greenwood Collection","Pennine Horizons Digital Archive","TIFF file 8-bit","English (U.K.)","Documentary photograph",AGW00189.TIF,"Hebden Bridge",,,,,,,,,,,,,,,,,,,,,,,,,,,,,,,,,,,"Buildings,Community Fair,Event,Events,Exhibition,Hebden Bridge,Stalls,Town Hall",https://www.penninehorizons.org/files/original/662e5621373f1a925174773b08d22411.jpg,"Still Image","Alan Greenwood Collection",1,0
271,https://www.penninehorizons.org/items/show/271,"Community Fayre at Hebden Bridge town Hall, October 2012 - AGW00190","Buildings, Community Fair, Event, Events, Exhibition, Hebden Bridge, Places, Stalls, Town Hall",,"Alan Greenwood","Alan Greenwood","Pennine Horizons Digital Archive",2012-10-13T10:13:09,"Alan Greenwood","PHDA - Alan Greenwood Collection","Pennine Horizons Digital Archive","TIFF file 8-bit","English (U.K.)","Documentary photograph",AGW00190.TIF,"Hebden Bridge",,,,,,,,,,,,,,,,,,,,,,,,,,,,,,,,,,,"Buildings,Community Fair,Event,Events,Exhibition,Hebden Bridge,Stalls,Town Hall",https://www.penninehorizons.org/files/original/a9204f6e9da687f067bdd1fdeb4177c7.jpg,"Still Image","Alan Greenwood Collection",1,0
272,https://www.penninehorizons.org/items/show/272,"Community Fayre at Hebden Bridge town Hall, October 2012 - AGW00191","Buildings, Community Fair, Event, Events, Exhibition, Hebden Bridge, Places, Stalls, Town Hall",,"Alan Greenwood","Alan Greenwood","Pennine Horizons Digital Archive",2012-10-13T10:12:59,"Alan Greenwood","PHDA - Alan Greenwood Collection","Pennine Horizons Digital Archive","TIFF file 8-bit","English (U.K.)","Documentary photograph",AGW00191.TIF,"Hebden Bridge",,,,,,,,,,,,,,,,,,,,,,,,,,,,,,,,,,,"Buildings,Community Fair,Event,Events,Exhibition,Hebden Bridge,Stalls,Town Hall",https://www.penninehorizons.org/files/original/430f7f5de23a4fbe14674066ee5318e4.jpg,"Still Image","Alan Greenwood Collection",1,0
4647,https://www.penninehorizons.org/items/show/4647,"Todmorden Market Place - April 1969 - DMC00375","Market, Stalls","Scanned from photograph","David Martin","Pennine Horizons Digital Archive","Pennine Horizons Digital Archive",1960s,"David Martin","PHDA - David Martin Collection","Pennine Horizons Digital Archive","TIFF file 8-bit","English (U.K.)","Documentary photograph",DMC00375.TIF,",  ",,,,,,,,,,,,,,,,,,,,,,,,,,,,,,,,,,,"1960s,Market,Stalls",https://www.penninehorizons.org/files/original/38c24e2231f0003820c996a22d1bfb55.jpg,"Still Image","David's Own Pictures",1,0
4792,https://www.penninehorizons.org/items/show/4792,"Brisk business at the stalls - DMC00521","Diamond Jubilee, Event, Events, Old Town, Stalls",,"David Martin","Pennine Horizons Digital Archive","Pennine Horizons Digital Archive",2012-06-02T12:47:27,"David Martin","PHDA - David Martin Collection","Pennine Horizons Digital Archive","TIFF file 8-bit","English (U.K.)","Documentary photograph",DMC00521.tif,",  ",,,,,,,,,,,,,,,,,,,,,,,,,,,,,,,,,,,"Diamond Jubilee,Event,Events,Old Town,Stalls",https://www.penninehorizons.org/files/original/fc8bef6cd12704b8d6c52a06b0a98af5.jpg,"Still Image","David's Own Pictures",1,0
4793,https://www.penninehorizons.org/items/show/4793,"Business is brisk - DMC00522","Diamond Jubilee, Event, Events, Old Town, Stalls",,"David Martin","Pennine Horizons Digital Archive","Pennine Horizons Digital Archive",2012-06-02T12:49:00,"David Martin","PHDA - David Martin Collection","Pennine Horizons Digital Archive","TIFF file 8-bit","English (U.K.)","Documentary photograph",DMC00522.tif,",  ",,,,,,,,,,,,,,,,,,,,,,,,,,,,,,,,,,,"Diamond Jubilee,Event,Events,Old Town,Stalls",https://www.penninehorizons.org/files/original/c7944a1bccf71d61c6ecd5211f69df13.jpg,"Still Image","David's Own Pictures",1,0
4815,https://www.penninehorizons.org/items/show/4815,"""It's worth it!"" - DMC00544","Diamond Jubilee, Event, Events, Old Town, Stalls",,"David Martin","Pennine Horizons Digital Archive","Pennine Horizons Digital Archive",2012-06-02T12:47:46,"David Martin","PHDA - David Martin Collection","Pennine Horizons Digital Archive","TIFF file 8-bit","English (U.K.)","Documentary photograph",DMC00544.tif,",  ",,,,,,,,,,,,,,,,,,,,,,,,,,,,,,,,,,,"Diamond Jubilee,Event,Events,Old Town,Stalls",https://www.penninehorizons.org/files/original/4e131244bf4ed4e0cb408373deb693e0.jpg,"Still Image","David's Own Pictures",1,0
